Information card for entry 7222035
Formula | C30 H37 N O3 |
Calculated formula | C30 H36.78 N O3 |
Title of publication | Structural transformations in crystals induced by radiation and pressure. Part 2. The path of a photochemical intramolecular reaction in crystals at different pressures |
Authors of publication | Konieczny, K.; Bąkowicz, J.; Turowska-Tyrk, I. |
Journal of publication | CrystEngComm |
Year of publication | 2015 |
Journal volume | 17 |
Journal issue | 40 |
Pages of publication | 7693 |
a | 5.8605 ± 0.0014 Å |
b | 8.2848 ± 0.001 Å |
c | 25.791 ± 0.009 Å |
α | 90.17 ± 0.02° |
β | 83.63 ± 0.04° |
γ | 75.954 ± 0.016° |
Cell volume | 1206.7 ± 0.5 Å3 |
Cell temperature | 299 ± 2 K |
Ambient diffraction temperature | 299 ± 2 K |
Cell measurement pressure | 900000 kPa |
Ambient diffracton pressure | 900000 kPa |
Number of distinct elements | 4 |
Space group number | 2 |
Hermann-Mauguin space group symbol | P -1 |
Hall space group symbol | -P 1 |
Residual factor for all reflections | 0.299 |
Residual factor for significantly intense reflections | 0.1408 |
Weighted residual factors for significantly intense reflections | 0.3361 |
Weighted residual factors for all reflections included in the refinement | 0.4385 |
Goodness-of-fit parameter for all reflections included in the refinement | 1.223 |
Diffraction radiation wavelength | 0.71073 Å |
Diffraction radiation type | MoKα |