Information card for entry 7222082
Common name | 1-{3-[(2-Hydroxy-3-methoxy-benzylidene)-amino]-phenyl}-ethanone |
Chemical name | 1-{3-[(2-Hydroxy-3-methoxy-benzylidene)-amino]-phenyl}-ethanone |
Formula | C16 H15 N O3 |
Calculated formula | C16 H15 N O3 |
SMILES | Oc1c(cccc1OC)/C=N/c1cc(ccc1)C(=O)C |
Title of publication | Polymorphism control in the mechanochemical and solution-based synthesis of a thermochromic Schiff base |
Authors of publication | Zbačnik, Marija; Nogalo, Ivana; Cinčić, Dominik; Kaitner, Branko |
Journal of publication | CrystEngComm |
Year of publication | 2015 |
Journal volume | 17 |
Journal issue | 41 |
Pages of publication | 7870 |
a | 19.139 ± 0.003 Å |
b | 5.314 ± 0.0013 Å |
c | 26 ± 0.005 Å |
α | 90° |
β | 90° |
γ | 90° |
Cell volume | 2644.3 ± 0.9 Å3 |
Cell temperature | 200 ± 2 K |
Ambient diffraction temperature | 200 ± 2 K |
Number of distinct elements | 4 |
Space group number | 33 |
Hermann-Mauguin space group symbol | P n a 21 |
Hall space group symbol | P 2c -2n |
Residual factor for all reflections | 0.1265 |
Residual factor for significantly intense reflections | 0.0996 |
Weighted residual factors for significantly intense reflections | 0.2809 |
Weighted residual factors for all reflections included in the refinement | 0.2945 |
Goodness-of-fit parameter for all reflections included in the refinement | 1.047 |
Diffraction radiation wavelength | 0.71073 Å |
Diffraction radiation type | MoKα |