Information card for entry 7222083
Common name | 1-{3-[(2-Hydroxy-3-methoxy-benzylidene)-amino]-phenyl}-ethanone |
Chemical name | 1-{3-[(2-Hydroxy-3-methoxy-benzylidene)-amino]-phenyl}-ethanone |
Formula | C16 H15 N O3 |
Calculated formula | C16 H15 N O3 |
SMILES | Oc1c(cccc1OC)/C=N/c1cccc(c1)C(=O)C |
Title of publication | Polymorphism control in the mechanochemical and solution-based synthesis of a thermochromic Schiff base |
Authors of publication | Zbačnik, Marija; Nogalo, Ivana; Cinčić, Dominik; Kaitner, Branko |
Journal of publication | CrystEngComm |
Year of publication | 2015 |
Journal volume | 17 |
Journal issue | 41 |
Pages of publication | 7870 |
a | 4.8773 ± 0.0005 Å |
b | 13.7541 ± 0.0014 Å |
c | 20.395 ± 0.0018 Å |
α | 90° |
β | 90° |
γ | 90° |
Cell volume | 1368.2 ± 0.2 Å3 |
Cell temperature | 298 ± 2 K |
Ambient diffraction temperature | 298 ± 2 K |
Number of distinct elements | 4 |
Space group number | 19 |
Hermann-Mauguin space group symbol | P 21 21 21 |
Hall space group symbol | P 2ac 2ab |
Residual factor for all reflections | 0.1348 |
Residual factor for significantly intense reflections | 0.0382 |
Weighted residual factors for significantly intense reflections | 0.071 |
Weighted residual factors for all reflections included in the refinement | 0.083 |
Goodness-of-fit parameter for all reflections included in the refinement | 0.681 |
Diffraction radiation wavelength | 0.71073 Å |
Diffraction radiation type | MoKα |