Information card for entry 7222084
Common name | 1-{3-[(2-Hydroxy-3-methoxy-benzylidene)-amino]-phenyl}-ethanone |
Chemical name | 1-{3-[(2-Hydroxy-3-methoxy-benzylidene)-amino]-phenyl}-ethanone |
Formula | C16 H15 N O3 |
Calculated formula | C16 H15 N O3 |
SMILES | Oc1c(cccc1OC)/C=N/c1cccc(c1)C(=O)C |
Title of publication | Polymorphism control in the mechanochemical and solution-based synthesis of a thermochromic Schiff base |
Authors of publication | Zbačnik, Marija; Nogalo, Ivana; Cinčić, Dominik; Kaitner, Branko |
Journal of publication | CrystEngComm |
Year of publication | 2015 |
Journal volume | 17 |
Journal issue | 41 |
Pages of publication | 7870 |
a | 7.4681 ± 0.0003 Å |
b | 13.1048 ± 0.0005 Å |
c | 13.9995 ± 0.0005 Å |
α | 90° |
β | 90° |
γ | 90° |
Cell volume | 1370.1 ± 0.09 Å3 |
Cell temperature | 298 K |
Ambient diffraction temperature | 298 K |
Number of distinct elements | 4 |
Space group number | 19 |
Hermann-Mauguin space group symbol | P 21 21 21 |
Hall space group symbol | P 2ac 2ab |
Residual factor for all reflections | 0.0921 |
Residual factor for significantly intense reflections | 0.0705 |
Weighted residual factors for significantly intense reflections | 0.2196 |
Weighted residual factors for all reflections included in the refinement | 0.2302 |
Goodness-of-fit parameter for all reflections included in the refinement | 1.038 |
Diffraction radiation wavelength | 0.71073 Å |
Diffraction radiation type | MoKα |