Information card for entry 7222120
Formula | C21 H18 Ce N O12 |
Calculated formula | C21 H18 Ce N O12 |
Title of publication | A series of homonuclear lanthanide coordination polymers based on a fluorescent conjugated ligand: syntheses, luminescence and sensor for pollutant chromate anion |
Authors of publication | Feng, Xun; Li, Rongfang; Wang, Liya; Ng, Seik Weng; Qin, Guozhan; Ma, Lufang |
Journal of publication | CrystEngComm |
Year of publication | 2015 |
Journal volume | 17 |
Journal issue | 41 |
Pages of publication | 7878 |
a | 14.7932 ± 0.0012 Å |
b | 14.7382 ± 0.0011 Å |
c | 10.6919 ± 0.0008 Å |
α | 90° |
β | 112.289 ± 0.001° |
γ | 90° |
Cell volume | 2156.9 ± 0.3 Å3 |
Cell temperature | 293 ± 2 K |
Ambient diffraction temperature | 293 ± 2 K |
Number of distinct elements | 5 |
Space group number | 15 |
Hermann-Mauguin space group symbol | C 1 2/c 1 |
Hall space group symbol | -C 2yc |
Residual factor for all reflections | 0.0358 |
Residual factor for significantly intense reflections | 0.0308 |
Weighted residual factors for significantly intense reflections | 0.0741 |
Weighted residual factors for all reflections included in the refinement | 0.078 |
Goodness-of-fit parameter for all reflections included in the refinement | 1.035 |
Diffraction radiation wavelength | 0.71073 Å |
Diffraction radiation type | MoKα |