Information card for entry 7222121
Formula | C21 H12 N Nd O9 |
Calculated formula | C21 H12 N Nd O9 |
Title of publication | A series of homonuclear lanthanide coordination polymers based on a fluorescent conjugated ligand: syntheses, luminescence and sensor for pollutant chromate anion |
Authors of publication | Feng, Xun; Li, Rongfang; Wang, Liya; Ng, Seik Weng; Qin, Guozhan; Ma, Lufang |
Journal of publication | CrystEngComm |
Year of publication | 2015 |
Journal volume | 17 |
Journal issue | 41 |
Pages of publication | 7878 |
a | 9.3219 ± 0.0006 Å |
b | 10.5274 ± 0.0006 Å |
c | 11.1369 ± 0.0007 Å |
α | 64.34 ± 0.001° |
β | 80.881 ± 0.001° |
γ | 82.009 ± 0.001° |
Cell volume | 969.64 ± 0.1 Å3 |
Cell temperature | 293 ± 2 K |
Ambient diffraction temperature | 293 ± 2 K |
Number of distinct elements | 5 |
Space group number | 2 |
Hermann-Mauguin space group symbol | P -1 |
Hall space group symbol | -P 1 |
Residual factor for all reflections | 0.0396 |
Residual factor for significantly intense reflections | 0.0353 |
Weighted residual factors for significantly intense reflections | 0.0941 |
Weighted residual factors for all reflections included in the refinement | 0.0966 |
Goodness-of-fit parameter for all reflections included in the refinement | 1.096 |
Diffraction radiation wavelength | 0.71073 Å |
Diffraction radiation type | MoKα |