Information card for entry 7222141
Formula | C30 H37 Co N15 O43 P W12 |
Calculated formula | C30 H37 Co N15 O43 P W12 |
Title of publication | Polyoxometalate-based metal‒organic coordination networks for heterogeneous catalytic desulfurization |
Authors of publication | Ma, Yuan-Yuan; Tan, Hua-Qiao; Wang, Yong-Hui; Hao, Xiu-Li; Feng, Xiao-Jia; Zang, Hong-Ying; Li, Yang-Guang |
Journal of publication | CrystEngComm |
Year of publication | 2015 |
Journal volume | 17 |
Journal issue | 41 |
Pages of publication | 7938 |
a | 39.245 ± 0.008 Å |
b | 15.242 ± 0.003 Å |
c | 23.514 ± 0.005 Å |
α | 90° |
β | 115.77 ± 0.03° |
γ | 90° |
Cell volume | 12667 ± 6 Å3 |
Cell temperature | 298 ± 2 K |
Ambient diffraction temperature | 298 ± 2 K |
Number of distinct elements | 7 |
Space group number | 15 |
Hermann-Mauguin space group symbol | C 1 2/c 1 |
Hall space group symbol | -C 2yc |
Residual factor for all reflections | 0.074 |
Residual factor for significantly intense reflections | 0.0459 |
Weighted residual factors for significantly intense reflections | 0.0898 |
Weighted residual factors for all reflections included in the refinement | 0.0986 |
Goodness-of-fit parameter for all reflections included in the refinement | 1.022 |
Diffraction radiation wavelength | 0.71073 Å |
Diffraction radiation type | MoKα |