Information card for entry 7222142
Formula | C120 H128 B2 Cu5 N60 O84 W24 |
Calculated formula | C120 H126 B2 Cu5 N60 O84 W24 |
Title of publication | Polyoxometalate-based metal‒organic coordination networks for heterogeneous catalytic desulfurization |
Authors of publication | Ma, Yuan-Yuan; Tan, Hua-Qiao; Wang, Yong-Hui; Hao, Xiu-Li; Feng, Xiao-Jia; Zang, Hong-Ying; Li, Yang-Guang |
Journal of publication | CrystEngComm |
Year of publication | 2015 |
Journal volume | 17 |
Journal issue | 41 |
Pages of publication | 7938 |
a | 51.26 ± 0.004 Å |
b | 15.4783 ± 0.001 Å |
c | 24.3771 ± 0.0016 Å |
α | 90° |
β | 103.921 ± 0.002° |
γ | 90° |
Cell volume | 18773 ± 2 Å3 |
Cell temperature | 298 ± 2 K |
Ambient diffraction temperature | 298 ± 2 K |
Number of distinct elements | 7 |
Space group number | 15 |
Hermann-Mauguin space group symbol | C 1 2/c 1 |
Hall space group symbol | -C 2yc |
Residual factor for all reflections | 0.1087 |
Residual factor for significantly intense reflections | 0.0866 |
Weighted residual factors for significantly intense reflections | 0.1705 |
Weighted residual factors for all reflections included in the refinement | 0.1822 |
Goodness-of-fit parameter for all reflections included in the refinement | 1.024 |
Diffraction radiation wavelength | 0.71073 Å |
Diffraction radiation type | MoKα |