Information card for entry 7222262
Formula
C24 H29 Br N5 Ni O5
Calculated formula
C20 H20 Br N4 Ni O4
Title of publication
Solvent-controlled formation of four Ni(II) coordination polymers based on flexible bis(imidazole) ligand: syntheses, structural diversification, properties
Authors of publication
Li, Xiu-Yuan; Liu, Xia-Xia; Yue, Kenfen; Wu, Ya-Pan; He, Tian; Yan, Ni; Wang, Yao-Yu
Journal of publication
RSC Adv.
Year of publication
2015
a
8.8813 ± 0.0018 Å
b
17.915 ± 0.004 Å
c
17.223 ± 0.003 Å
α
90°
β
96.942 ± 0.004°
γ
90°
Cell volume
2720.2 ± 0.9 Å3
Cell temperature
296 ± 2 K
Ambient diffraction temperature
296 ± 2 K
Number of distinct elements
6
Space group number
11
Hermann-Mauguin space group symbol
P 1 21/m 1
Hall space group symbol
-P 2yb
Residual factor for all reflections
0.1345
Residual factor for significantly intense reflections
0.0781
Weighted residual factors for significantly intense reflections
0.2014
Weighted residual factors for all reflections included in the refinement
0.2274
Goodness-of-fit parameter for all reflections included in the refinement
1.057
Diffraction radiation wavelength
0.71073 Å
Diffraction radiation type
MoKα
Yes
No
No