Information card for entry 7222263
Formula | C20 H20 Co F4 N4 O5 |
Calculated formula | C20 H20 Co F4 N4 O5 |
Title of publication | A series of reaction-controlled coordination polymers constructed from bis(imidazole) and tetrafluoroterephthalic acid ligands: syntheses, structural diversities, properties |
Authors of publication | Li, Xiu-Yuan; Liu, Meng; Yue, Ke-Fen; Wu, Ya-Pan; He, Tian; Yan, Ni; Wang, Yao-Yu |
Journal of publication | CrystEngComm |
Year of publication | 2015 |
Journal volume | 17 |
Journal issue | 43 |
Pages of publication | 8273 |
a | 18.134 ± 0.002 Å |
b | 13.8355 ± 0.0016 Å |
c | 9.3325 ± 0.001 Å |
α | 90° |
β | 90° |
γ | 90° |
Cell volume | 2341.5 ± 0.5 Å3 |
Cell temperature | 296 ± 2 K |
Ambient diffraction temperature | 296 ± 2 K |
Number of distinct elements | 6 |
Space group number | 52 |
Hermann-Mauguin space group symbol | P n n a |
Hall space group symbol | -P 2a 2bc |
Residual factor for all reflections | 0.068 |
Residual factor for significantly intense reflections | 0.0382 |
Weighted residual factors for significantly intense reflections | 0.0714 |
Weighted residual factors for all reflections included in the refinement | 0.0811 |
Goodness-of-fit parameter for all reflections included in the refinement | 1.009 |
Diffraction radiation wavelength | 0.71073 Å |
Diffraction radiation type | MoKα |