Information card for entry 7222267
Formula | C32 H34 Cd F8 N4 O12 |
Calculated formula | C32 H34 Cd F8 N4 O12 |
Title of publication | A series of reaction-controlled coordination polymers constructed from bis(imidazole) and tetrafluoroterephthalic acid ligands: syntheses, structural diversities, properties |
Authors of publication | Li, Xiu-Yuan; Liu, Meng; Yue, Ke-Fen; Wu, Ya-Pan; He, Tian; Yan, Ni; Wang, Yao-Yu |
Journal of publication | CrystEngComm |
Year of publication | 2015 |
Journal volume | 17 |
Journal issue | 43 |
Pages of publication | 8273 |
a | 9.2303 ± 0.0013 Å |
b | 11.4497 ± 0.0015 Å |
c | 11.7396 ± 0.0015 Å |
α | 119.054 ± 0.002° |
β | 90.297 ± 0.002° |
γ | 111.767 ± 0.002° |
Cell volume | 980.7 ± 0.2 Å3 |
Cell temperature | 296 ± 2 K |
Ambient diffraction temperature | 296 ± 2 K |
Number of distinct elements | 6 |
Space group number | 2 |
Hermann-Mauguin space group symbol | P -1 |
Hall space group symbol | -P 1 |
Residual factor for all reflections | 0.061 |
Residual factor for significantly intense reflections | 0.0522 |
Weighted residual factors for significantly intense reflections | 0.1316 |
Weighted residual factors for all reflections included in the refinement | 0.1411 |
Goodness-of-fit parameter for all reflections included in the refinement | 0.885 |
Diffraction radiation wavelength | 0.71073 Å |
Diffraction radiation type | MoKα |