Information card for entry 7222266
Formula | C32 H34 Co F8 N4 O12 |
Calculated formula | C32 H34 Co F8 N4 O12 |
Title of publication | A series of reaction-controlled coordination polymers constructed from bis(imidazole) and tetrafluoroterephthalic acid ligands: syntheses, structural diversities, properties |
Authors of publication | Li, Xiu-Yuan; Liu, Meng; Yue, Ke-Fen; Wu, Ya-Pan; He, Tian; Yan, Ni; Wang, Yao-Yu |
Journal of publication | CrystEngComm |
Year of publication | 2015 |
Journal volume | 17 |
Journal issue | 43 |
Pages of publication | 8273 |
a | 9.437 ± 0.002 Å |
b | 11.304 ± 0.004 Å |
c | 11.371 ± 0.003 Å |
α | 116.906 ± 0.005° |
β | 113.912 ± 0.004° |
γ | 92.898 ± 0.006° |
Cell volume | 947.3 ± 0.5 Å3 |
Cell temperature | 296 ± 2 K |
Ambient diffraction temperature | 296 ± 2 K |
Number of distinct elements | 6 |
Space group number | 2 |
Hermann-Mauguin space group symbol | P -1 |
Hall space group symbol | -P 1 |
Residual factor for all reflections | 0.0911 |
Residual factor for significantly intense reflections | 0.076 |
Weighted residual factors for significantly intense reflections | 0.1932 |
Weighted residual factors for all reflections included in the refinement | 0.2182 |
Goodness-of-fit parameter for all reflections included in the refinement | 1.108 |
Diffraction radiation wavelength | 0.71073 Å |
Diffraction radiation type | MoKα |