Information card for entry 7222324
Formula | C24 H19 Er N4 O8 S |
Calculated formula | C24 H17 Er N4 O8 S |
Title of publication | Controllable synthesis of four series of lanthanide coordination polymers: synthesis, structures, luminescent and magnetic properties |
Authors of publication | An, Ran; Wang, Xiaofang; Hu, Huai-Ming; Zhao, Zhui; Bai, Chao; Xue, Ganglin |
Journal of publication | CrystEngComm |
Year of publication | 2015 |
Journal volume | 17 |
Journal issue | 43 |
Pages of publication | 8289 |
a | 8.872 ± 0.007 Å |
b | 9.023 ± 0.008 Å |
c | 14.475 ± 0.012 Å |
α | 94.059 ± 0.016° |
β | 91.016 ± 0.014° |
γ | 98.053 ± 0.016° |
Cell volume | 1144 ± 1.7 Å3 |
Cell temperature | 296 ± 2 K |
Ambient diffraction temperature | 296 ± 2 K |
Number of distinct elements | 6 |
Space group number | 2 |
Hermann-Mauguin space group symbol | P -1 |
Hall space group symbol | -P 1 |
Residual factor for all reflections | 0.18 |
Residual factor for significantly intense reflections | 0.0987 |
Weighted residual factors for significantly intense reflections | 0.1945 |
Weighted residual factors for all reflections included in the refinement | 0.236 |
Goodness-of-fit parameter for all reflections included in the refinement | 0.958 |
Diffraction radiation wavelength | 0.71073 Å |
Diffraction radiation type | MoKα |