Information card for entry 7222325
Formula | C24 H19 N4 O8 S Y |
Calculated formula | C24 H19 N4 O8 S Y |
Title of publication | Controllable synthesis of four series of lanthanide coordination polymers: synthesis, structures, luminescent and magnetic properties |
Authors of publication | An, Ran; Wang, Xiaofang; Hu, Huai-Ming; Zhao, Zhui; Bai, Chao; Xue, Ganglin |
Journal of publication | CrystEngComm |
Year of publication | 2015 |
Journal volume | 17 |
Journal issue | 43 |
Pages of publication | 8289 |
a | 8.8933 ± 0.0019 Å |
b | 9.0472 ± 0.0019 Å |
c | 14.467 ± 0.003 Å |
α | 94.285 ± 0.004° |
β | 90.906 ± 0.004° |
γ | 98.511 ± 0.004° |
Cell volume | 1147.5 ± 0.4 Å3 |
Cell temperature | 296 ± 2 K |
Ambient diffraction temperature | 296 ± 2 K |
Number of distinct elements | 6 |
Space group number | 2 |
Hermann-Mauguin space group symbol | P -1 |
Hall space group symbol | -P 1 |
Residual factor for all reflections | 0.0736 |
Residual factor for significantly intense reflections | 0.05 |
Weighted residual factors for significantly intense reflections | 0.1063 |
Weighted residual factors for all reflections included in the refinement | 0.1189 |
Goodness-of-fit parameter for all reflections included in the refinement | 1.051 |
Diffraction radiation wavelength | 0.71073 Å |
Diffraction radiation type | MoKα |