Information card for entry 7222326
Formula | C24 H19 N4 O8 Pr S |
Calculated formula | C24 H19 N4 O8 Pr S |
Title of publication | Controllable synthesis of four series of lanthanide coordination polymers: synthesis, structures, luminescent and magnetic properties |
Authors of publication | An, Ran; Wang, Xiaofang; Hu, Huai-Ming; Zhao, Zhui; Bai, Chao; Xue, Ganglin |
Journal of publication | CrystEngComm |
Year of publication | 2015 |
Journal volume | 17 |
Journal issue | 43 |
Pages of publication | 8289 |
a | 13.6008 ± 0.0012 Å |
b | 13.5013 ± 0.0012 Å |
c | 13.133 ± 0.0012 Å |
α | 90° |
β | 96.231 ± 0.001° |
γ | 90° |
Cell volume | 2397.3 ± 0.4 Å3 |
Cell temperature | 296 ± 2 K |
Ambient diffraction temperature | 296 ± 2 K |
Number of distinct elements | 6 |
Space group number | 14 |
Hermann-Mauguin space group symbol | P 1 21/c 1 |
Hall space group symbol | -P 2ybc |
Residual factor for all reflections | 0.0274 |
Residual factor for significantly intense reflections | 0.0216 |
Weighted residual factors for significantly intense reflections | 0.0456 |
Weighted residual factors for all reflections included in the refinement | 0.0475 |
Goodness-of-fit parameter for all reflections included in the refinement | 1.048 |
Diffraction radiation wavelength | 0.71073 Å |
Diffraction radiation type | MoKα |