Information card for entry 7223050
Formula | C56 H42 N8 O8 Zn2 |
Calculated formula | C56 H42 N8 O8 Zn2 |
Title of publication | Coligand syntheses, crystal structures, luminescence and photocatalytic properties of five coordination polymers based on rigid tetracarboxylic acids and imidazole linkers |
Authors of publication | Fan, Liming; Fan, Weiliu; Li, Bin; Zhao, Xian; Zhang, Xiutang |
Journal of publication | CrystEngComm |
Year of publication | 2015 |
Journal volume | 17 |
Journal issue | 48 |
Pages of publication | 9413 |
a | 9.3753 ± 0.0004 Å |
b | 16.5379 ± 0.0008 Å |
c | 18.0472 ± 0.0009 Å |
α | 90° |
β | 101.094 ± 0.001° |
γ | 90° |
Cell volume | 2745.9 ± 0.2 Å3 |
Cell temperature | 296 ± 2 K |
Ambient diffraction temperature | 296 ± 2 K |
Number of distinct elements | 5 |
Space group number | 14 |
Hermann-Mauguin space group symbol | P 1 21/n 1 |
Hall space group symbol | -P 2yn |
Residual factor for all reflections | 0.0706 |
Residual factor for significantly intense reflections | 0.0476 |
Weighted residual factors for significantly intense reflections | 0.128 |
Weighted residual factors for all reflections included in the refinement | 0.1359 |
Goodness-of-fit parameter for all reflections included in the refinement | 1.09 |
Diffraction radiation wavelength | 0.71073 Å |
Diffraction radiation type | MoKα |