Information card for entry 7223051
Formula | C28 H23 N4 O5 Zn |
Calculated formula | C28 H23 N4 O5 Zn |
Title of publication | Coligand syntheses, crystal structures, luminescence and photocatalytic properties of five coordination polymers based on rigid tetracarboxylic acids and imidazole linkers |
Authors of publication | Fan, Liming; Fan, Weiliu; Li, Bin; Zhao, Xian; Zhang, Xiutang |
Journal of publication | CrystEngComm |
Year of publication | 2015 |
Journal volume | 17 |
Journal issue | 48 |
Pages of publication | 9413 |
a | 8.928 ± 0.002 Å |
b | 16.369 ± 0.004 Å |
c | 17.65 ± 0.004 Å |
α | 90° |
β | 99.023 ± 0.004° |
γ | 90° |
Cell volume | 2547.5 ± 1 Å3 |
Cell temperature | 296 ± 2 K |
Ambient diffraction temperature | 296 ± 2 K |
Number of distinct elements | 5 |
Space group number | 14 |
Hermann-Mauguin space group symbol | P 1 21/n 1 |
Hall space group symbol | -P 2yn |
Residual factor for all reflections | 0.0866 |
Residual factor for significantly intense reflections | 0.0574 |
Weighted residual factors for significantly intense reflections | 0.1738 |
Weighted residual factors for all reflections included in the refinement | 0.1937 |
Goodness-of-fit parameter for all reflections included in the refinement | 1.049 |
Diffraction radiation wavelength | 0.71073 Å |
Diffraction radiation type | MoKα |