Information card for entry 7223054
Formula | C25 H21 N4 Ni O5 |
Calculated formula | C25 H19 N4 Ni O4 |
Title of publication | Coligand syntheses, crystal structures, luminescence and photocatalytic properties of five coordination polymers based on rigid tetracarboxylic acids and imidazole linkers |
Authors of publication | Fan, Liming; Fan, Weiliu; Li, Bin; Zhao, Xian; Zhang, Xiutang |
Journal of publication | CrystEngComm |
Year of publication | 2015 |
Journal volume | 17 |
Journal issue | 48 |
Pages of publication | 9413 |
a | 7.455 ± 0.006 Å |
b | 17.478 ± 0.014 Å |
c | 17.024 ± 0.013 Å |
α | 90° |
β | 101.686 ± 0.013° |
γ | 90° |
Cell volume | 2172 ± 3 Å3 |
Cell temperature | 293 ± 2 K |
Ambient diffraction temperature | 293 ± 2 K |
Number of distinct elements | 5 |
Space group number | 14 |
Hermann-Mauguin space group symbol | P 1 21/n 1 |
Hall space group symbol | -P 2yn |
Residual factor for all reflections | 0.0931 |
Residual factor for significantly intense reflections | 0.0553 |
Weighted residual factors for significantly intense reflections | 0.1341 |
Weighted residual factors for all reflections included in the refinement | 0.1506 |
Goodness-of-fit parameter for all reflections included in the refinement | 0.963 |
Diffraction radiation wavelength | 0.71073 Å |
Diffraction radiation type | MoKα |