Information card for entry 7223053
Formula | C74 H44 Co4 N12 O18 |
Calculated formula | C74 H44 Co4 N12 O18 |
Title of publication | Coligand syntheses, crystal structures, luminescence and photocatalytic properties of five coordination polymers based on rigid tetracarboxylic acids and imidazole linkers |
Authors of publication | Fan, Liming; Fan, Weiliu; Li, Bin; Zhao, Xian; Zhang, Xiutang |
Journal of publication | CrystEngComm |
Year of publication | 2015 |
Journal volume | 17 |
Journal issue | 48 |
Pages of publication | 9413 |
a | 11.573 ± 0.003 Å |
b | 13.892 ± 0.004 Å |
c | 14.655 ± 0.004 Å |
α | 62.631 ± 0.004° |
β | 68.977 ± 0.004° |
γ | 68.8 ± 0.004° |
Cell volume | 1897.3 ± 0.9 Å3 |
Cell temperature | 293 ± 2 K |
Ambient diffraction temperature | 293 ± 2 K |
Number of distinct elements | 5 |
Space group number | 2 |
Hermann-Mauguin space group symbol | P -1 |
Hall space group symbol | -P 1 |
Residual factor for all reflections | 0.083 |
Residual factor for significantly intense reflections | 0.0544 |
Weighted residual factors for significantly intense reflections | 0.1395 |
Weighted residual factors for all reflections included in the refinement | 0.1533 |
Goodness-of-fit parameter for all reflections included in the refinement | 1.033 |
Diffraction radiation wavelength | 0.71073 Å |
Diffraction radiation type | MoKα |