Information card for entry 7223194
Formula | C6 H12 Mg N O9 P |
Calculated formula | C6 H12 Mg N O9 P |
Title of publication | Solvent-free synthesis of new magnesium phosphate‒oxalates displaying diverse framework topologies |
Authors of publication | Zhang, Wei; Kang, Maoping; Yang, Meng; Luo, Daibing; Lin, Zhien |
Journal of publication | CrystEngComm |
Year of publication | 2015 |
Journal volume | 17 |
Journal issue | 48 |
Pages of publication | 9296 |
a | 9.3755 ± 0.0002 Å |
b | 7.4746 ± 0.0001 Å |
c | 15.431 ± 0.0002 Å |
α | 90° |
β | 100.119 ± 0.002° |
γ | 90° |
Cell volume | 1064.55 ± 0.03 Å3 |
Cell temperature | 292.1 ± 0.3 K |
Ambient diffraction temperature | 292.1 ± 0.3 K |
Number of distinct elements | 6 |
Space group number | 14 |
Hermann-Mauguin space group symbol | P 1 21/n 1 |
Hall space group symbol | -P 2yn |
Residual factor for all reflections | 0.0452 |
Residual factor for significantly intense reflections | 0.042 |
Weighted residual factors for significantly intense reflections | 0.1123 |
Weighted residual factors for all reflections included in the refinement | 0.1159 |
Goodness-of-fit parameter for all reflections included in the refinement | 1.116 |
Diffraction radiation probe | x-ray |
Diffraction radiation wavelength | 1.54184 Å |
Diffraction radiation type | CuKα |