Information card for entry 7223195
Formula | C18 H38 Mg4 N3 O30 P3 |
Calculated formula | C18 H34 Mg4 N3 O30 P3 |
Title of publication | Solvent-free synthesis of new magnesium phosphate‒oxalates displaying diverse framework topologies |
Authors of publication | Zhang, Wei; Kang, Maoping; Yang, Meng; Luo, Daibing; Lin, Zhien |
Journal of publication | CrystEngComm |
Year of publication | 2015 |
Journal volume | 17 |
Journal issue | 48 |
Pages of publication | 9296 |
a | 15.1014 ± 0.0002 Å |
b | 10.96857 ± 0.00017 Å |
c | 22.3338 ± 0.0004 Å |
α | 90° |
β | 103.099 ± 0.0015° |
γ | 90° |
Cell volume | 3603.12 ± 0.1 Å3 |
Cell temperature | 293.15 K |
Ambient diffraction temperature | 293.15 K |
Number of distinct elements | 6 |
Space group number | 15 |
Hermann-Mauguin space group symbol | C 1 2/c 1 |
Hall space group symbol | -C 2yc |
Residual factor for all reflections | 0.0514 |
Residual factor for significantly intense reflections | 0.0486 |
Weighted residual factors for significantly intense reflections | 0.1333 |
Weighted residual factors for all reflections included in the refinement | 0.1366 |
Goodness-of-fit parameter for all reflections included in the refinement | 1.032 |
Diffraction radiation probe | x-ray |
Diffraction radiation wavelength | 1.54184 Å |
Diffraction radiation type | CuKα |