Information card for entry 7223198
Formula | C35 H24 S |
Calculated formula | C35 H24 S |
SMILES | C1(=C(C=C(C1)c1ccc(cc1)c1cccc2c1sc1c2cccc1)c1ccccc1)c1ccccc1 |
Title of publication | Morphology-controlled assembly and enhanced emission of fluorescence in organic nanospheres and microrods based on 1,2-diphenyl-4-(4-dibenzothienyl)phenyl-1,3-cyclopentadiene |
Authors of publication | Ye, Junwei; Huang, Xueming; Gao, Yuan; Wang, Xiaoxiao; Zheng, Ting; Lin, Yuan; Liu, Xin; Ning, Guiling |
Journal of publication | CrystEngComm |
Year of publication | 2015 |
Journal volume | 17 |
Journal issue | 48 |
Pages of publication | 9311 |
a | 13.805 ± 0.003 Å |
b | 23.501 ± 0.006 Å |
c | 7.6773 ± 0.0018 Å |
α | 90° |
β | 90° |
γ | 90° |
Cell volume | 2490.8 ± 1 Å3 |
Cell temperature | 296 ± 2 K |
Ambient diffraction temperature | 296 ± 2 K |
Number of distinct elements | 3 |
Space group number | 29 |
Hermann-Mauguin space group symbol | P c a 21 |
Hall space group symbol | P 2c -2ac |
Residual factor for all reflections | 0.0916 |
Residual factor for significantly intense reflections | 0.0527 |
Weighted residual factors for significantly intense reflections | 0.1051 |
Weighted residual factors for all reflections included in the refinement | 0.1178 |
Goodness-of-fit parameter for all reflections included in the refinement | 1.026 |
Diffraction radiation wavelength | 0.71073 Å |
Diffraction radiation type | MoKα |