Information card for entry 7223197
Formula | C10 H29 Mg2 N3 O19 P2 |
Calculated formula | C10 H27 Mg2 N3 O19 P2 |
Title of publication | Solvent-free synthesis of new magnesium phosphate‒oxalates displaying diverse framework topologies |
Authors of publication | Zhang, Wei; Kang, Maoping; Yang, Meng; Luo, Daibing; Lin, Zhien |
Journal of publication | CrystEngComm |
Year of publication | 2015 |
Journal volume | 17 |
Journal issue | 48 |
Pages of publication | 9296 |
a | 9.3254 ± 0.0002 Å |
b | 9.428 ± 0.0003 Å |
c | 14.306 ± 0.0004 Å |
α | 96.449 ± 0.002° |
β | 103.879 ± 0.002° |
γ | 104.35 ± 0.002° |
Cell volume | 1163.07 ± 0.06 Å3 |
Cell temperature | 292.8 ± 0.4 K |
Ambient diffraction temperature | 292.8 ± 0.4 K |
Number of distinct elements | 6 |
Space group number | 2 |
Hermann-Mauguin space group symbol | P -1 |
Hall space group symbol | -P 1 |
Residual factor for all reflections | 0.0487 |
Residual factor for significantly intense reflections | 0.0462 |
Weighted residual factors for significantly intense reflections | 0.1285 |
Weighted residual factors for all reflections included in the refinement | 0.1327 |
Goodness-of-fit parameter for all reflections included in the refinement | 1.063 |
Diffraction radiation probe | x-ray |
Diffraction radiation wavelength | 1.54184 Å |
Diffraction radiation type | CuKα |