Information card for entry 7223387
Chemical name | 4-methoxysalicylaldehyde 4-hydroxybenzhydrazone |
Formula | C15 H14 N2 O4 |
Calculated formula | C15 H14 N2 O4 |
SMILES | COc1cc(c(/C=N/NC(=O)c2ccc(O)cc2)cc1)O |
Title of publication | Cobalt(III) complexes with tridentate hydrazone ligands: protonation state and hydrogen bonds competition |
Authors of publication | Vrdoljak, Visnja; Pavlović, Gordana; Hrenar, Tomica; Rubčić, Mirta; Siega, Patrizia; Dreos, Renata; Cindric, Marina |
Journal of publication | RSC Adv. |
Year of publication | 2015 |
a | 15.1547 ± 0.0003 Å |
b | 8.3437 ± 0.0002 Å |
c | 10.963 ± 0.0002 Å |
α | 90° |
β | 101.307 ± 0.002° |
γ | 90° |
Cell volume | 1359.32 ± 0.05 Å3 |
Cell temperature | 296 ± 2 K |
Ambient diffraction temperature | 296 ± 2 K |
Number of distinct elements | 4 |
Space group number | 14 |
Hermann-Mauguin space group symbol | P 1 21/c 1 |
Hall space group symbol | -P 2ybc |
Residual factor for all reflections | 0.0514 |
Residual factor for significantly intense reflections | 0.0402 |
Weighted residual factors for significantly intense reflections | 0.1044 |
Weighted residual factors for all reflections included in the refinement | 0.1122 |
Goodness-of-fit parameter for all reflections included in the refinement | 1.032 |
Diffraction radiation wavelength | 0.71073 Å |
Diffraction radiation type | MoKα |