Information card for entry 7223388
Chemical name | 3-methoxysalicylaldehyde benzhydrazone |
Formula | C15 H14 N2 O3 |
Calculated formula | C15 H14 N2 O3 |
SMILES | N(=C\c1c(O)c(OC)ccc1)/NC(=O)c1ccccc1 |
Title of publication | Cobalt(III) complexes with tridentate hydrazone ligands: protonation state and hydrogen bonds competition |
Authors of publication | Vrdoljak, Visnja; Pavlović, Gordana; Hrenar, Tomica; Rubčić, Mirta; Siega, Patrizia; Dreos, Renata; Cindric, Marina |
Journal of publication | RSC Adv. |
Year of publication | 2015 |
a | 9.1617 ± 0.0005 Å |
b | 6.1414 ± 0.0004 Å |
c | 23.4795 ± 0.0012 Å |
α | 90° |
β | 94.806 ± 0.005° |
γ | 90° |
Cell volume | 1316.44 ± 0.13 Å3 |
Cell temperature | 296 ± 2 K |
Ambient diffraction temperature | 296 ± 2 K |
Number of distinct elements | 4 |
Space group number | 14 |
Hermann-Mauguin space group symbol | P 1 21/n 1 |
Hall space group symbol | -P 2yn |
Residual factor for all reflections | 0.0862 |
Residual factor for significantly intense reflections | 0.0458 |
Weighted residual factors for significantly intense reflections | 0.094 |
Weighted residual factors for all reflections included in the refinement | 0.1078 |
Goodness-of-fit parameter for all reflections included in the refinement | 1.015 |
Diffraction radiation wavelength | 0.71073 Å |
Diffraction radiation type | MoKα |