Information card for entry 7223391
Chemical name | (2-oxy-3-methoxybenzaldehyde 4-hydroxybenzoylhydrazonato-O,N,O) (2-oxy-3-methoxybenzaldehyde 4-hydroxybenzoylhydrazidato-O,N,O) cobalt(III) |
Formula | C30 H25 Co N4 O8 |
Calculated formula | C30 H25 Co N4 O8 |
SMILES | [Co]1234([N](NC(=[O]1)c1ccc(O)cc1)=Cc1c(O2)c(OC)ccc1)[N](N=C(O3)c1ccc(O)cc1)=Cc1c(O4)c(OC)ccc1 |
Title of publication | Cobalt(III) complexes with tridentate hydrazone ligands: protonation state and hydrogen bonds competition |
Authors of publication | Vrdoljak, Visnja; Pavlović, Gordana; Hrenar, Tomica; Rubčić, Mirta; Siega, Patrizia; Dreos, Renata; Cindric, Marina |
Journal of publication | RSC Adv. |
Year of publication | 2015 |
a | 10.2428 ± 0.0004 Å |
b | 12.2495 ± 0.0004 Å |
c | 13.1323 ± 0.0006 Å |
α | 102.594 ± 0.003° |
β | 107.08 ± 0.004° |
γ | 97.463 ± 0.003° |
Cell volume | 1503.55 ± 0.11 Å3 |
Cell temperature | 296 ± 2 K |
Ambient diffraction temperature | 296 ± 2 K |
Number of distinct elements | 5 |
Space group number | 2 |
Hermann-Mauguin space group symbol | P -1 |
Hall space group symbol | -P 1 |
Residual factor for all reflections | 0.063 |
Residual factor for significantly intense reflections | 0.0532 |
Weighted residual factors for significantly intense reflections | 0.1488 |
Weighted residual factors for all reflections included in the refinement | 0.1571 |
Goodness-of-fit parameter for all reflections included in the refinement | 1.065 |
Diffraction radiation wavelength | 1.54184 Å |
Diffraction radiation type | CuKα |