Information card for entry 7223390
Chemical name | (2-oxybenzaldehyde 4-hydroxybenzoylhydrazonato-O,N,O) (2-oxybenzaldehyde 4-hydroxybenzoylhydrazidato-O,N,O)cobalt(III) |
Formula | C28 H21 Co N4 O6 |
Calculated formula | C28 H21 Co N4 O6 |
Title of publication | Cobalt(III) complexes with tridentate hydrazone ligands: protonation state and hydrogen bonds competition |
Authors of publication | Vrdoljak, Visnja; Pavlović, Gordana; Hrenar, Tomica; Rubčić, Mirta; Siega, Patrizia; Dreos, Renata; Cindric, Marina |
Journal of publication | RSC Adv. |
Year of publication | 2015 |
a | 11.5874 ± 0.0006 Å |
b | 18.953 ± 0.0009 Å |
c | 23.142 ± 0.0014 Å |
α | 90° |
β | 90° |
γ | 90° |
Cell volume | 5082.4 ± 0.5 Å3 |
Cell temperature | 296 ± 2 K |
Ambient diffraction temperature | 296 ± 2 K |
Number of distinct elements | 5 |
Space group number | 73 |
Hermann-Mauguin space group symbol | I b c a |
Hall space group symbol | -I 2b 2c |
Residual factor for all reflections | 0.0736 |
Residual factor for significantly intense reflections | 0.0512 |
Weighted residual factors for significantly intense reflections | 0.1151 |
Weighted residual factors for all reflections included in the refinement | 0.1305 |
Goodness-of-fit parameter for all reflections included in the refinement | 1.019 |
Diffraction radiation wavelength | 1.54184 Å |
Diffraction radiation type | CuKα |