Information card for entry 7223742
Formula | C42 H50 Cu F6 N6 P |
Calculated formula | C42 H50 Cu F6 N6 P |
Title of publication | Synthesis of new phosphorescent imidoyl-indazol and phosphines mixed ligand Cu(I) complexes - Structural characterization and photophysical properties |
Authors of publication | Cabrera, Alan Raul; González, Iván Alonso; Cortés-Arriagada, Diego; Natali, Mirco; Berke, Heinz; Daniliuc, Constantin Gabriel; Camarada, María Belen; Toro-Labbé, Alejandro; Rojas, Rene S.; salas, cristian osvaldo |
Journal of publication | RSC Adv. |
Year of publication | 2016 |
a | 32.1326 ± 0.0006 Å |
b | 12.6582 ± 0.0002 Å |
c | 22.0163 ± 0.0005 Å |
α | 90° |
β | 98.758 ± 0.001° |
γ | 90° |
Cell volume | 8850.5 ± 0.3 Å3 |
Cell temperature | 223 ± 2 K |
Ambient diffraction temperature | 223 ± 2 K |
Number of distinct elements | 6 |
Space group number | 15 |
Hermann-Mauguin space group symbol | C 1 2/c 1 |
Hall space group symbol | -C 2yc |
Residual factor for all reflections | 0.113 |
Residual factor for significantly intense reflections | 0.0828 |
Weighted residual factors for significantly intense reflections | 0.2083 |
Weighted residual factors for all reflections included in the refinement | 0.2271 |
Goodness-of-fit parameter for all reflections included in the refinement | 1.061 |
Diffraction radiation wavelength | 0.71073 Å |
Diffraction radiation type | MoKα |