Information card for entry 7223743
Formula | C57 H53 Cu F6 N3 O P3 |
Calculated formula | C57 H53 Cu F6 N3 O P3 |
Title of publication | Synthesis of new phosphorescent imidoyl-indazol and phosphines mixed ligand Cu(I) complexes - Structural characterization and photophysical properties |
Authors of publication | Cabrera, Alan Raul; González, Iván Alonso; Cortés-Arriagada, Diego; Natali, Mirco; Berke, Heinz; Daniliuc, Constantin Gabriel; Camarada, María Belen; Toro-Labbé, Alejandro; Rojas, Rene S.; salas, cristian osvaldo |
Journal of publication | RSC Adv. |
Year of publication | 2016 |
a | 11.8896 ± 0.0002 Å |
b | 15.4611 ± 0.0003 Å |
c | 16.759 ± 0.0004 Å |
α | 96.01 ± 0.001° |
β | 93.695 ± 0.001° |
γ | 92.264 ± 0.001° |
Cell volume | 3054.12 ± 0.11 Å3 |
Cell temperature | 223 ± 2 K |
Ambient diffraction temperature | 223 ± 2 K |
Number of distinct elements | 7 |
Space group number | 2 |
Hermann-Mauguin space group symbol | P -1 |
Hall space group symbol | -P 1 |
Residual factor for all reflections | 0.0764 |
Residual factor for significantly intense reflections | 0.0643 |
Weighted residual factors for significantly intense reflections | 0.1607 |
Weighted residual factors for all reflections included in the refinement | 0.1686 |
Goodness-of-fit parameter for all reflections included in the refinement | 1.027 |
Diffraction radiation wavelength | 0.71073 Å |
Diffraction radiation type | MoKα |