Information card for entry 7223777
Formula | C14 H20 Ag N3 O0 |
Calculated formula | C14 H20 Ag N3 |
Title of publication | Guest-containing supramolecular isomers of silver(i) 3,5-dialkyl-1,2,4-triazolates: syntheses, structures, and structural transformation behaviours |
Authors of publication | Yang, Xiao; Wang, Yu; Zhou, Hao-Long; Liu, Yi-Jiang; He, Chun-Ting; Lin, Rui-Biao; Zhang, Jie-Peng |
Journal of publication | CrystEngComm |
Year of publication | 2015 |
Journal volume | 17 |
Journal issue | 46 |
Pages of publication | 8843 |
a | 16.332 ± 0.002 Å |
b | 16.332 Å |
c | 16.332 Å |
α | 90° |
β | 90° |
γ | 90° |
Cell volume | 4356.3 ± 0.5 Å3 |
Cell temperature | 113 ± 2 K |
Ambient diffraction temperature | 113 ± 2 K |
Number of distinct elements | 5 |
Space group number | 204 |
Hermann-Mauguin space group symbol | I m -3 |
Hall space group symbol | -I 2 2 3 |
Residual factor for all reflections | 0.0521 |
Residual factor for significantly intense reflections | 0.0391 |
Weighted residual factors for significantly intense reflections | 0.1002 |
Weighted residual factors for all reflections included in the refinement | 0.1195 |
Goodness-of-fit parameter for all reflections included in the refinement | 1.095 |
Diffraction radiation wavelength | 0.71073 Å |
Diffraction radiation type | MoKα |