Information card for entry 7223778
Formula | C71 H122 Ag8 N24 O |
Calculated formula | C71 H122 Ag8 N24 O |
Title of publication | Guest-containing supramolecular isomers of silver(i) 3,5-dialkyl-1,2,4-triazolates: syntheses, structures, and structural transformation behaviours |
Authors of publication | Yang, Xiao; Wang, Yu; Zhou, Hao-Long; Liu, Yi-Jiang; He, Chun-Ting; Lin, Rui-Biao; Zhang, Jie-Peng |
Journal of publication | CrystEngComm |
Year of publication | 2015 |
Journal volume | 17 |
Journal issue | 46 |
Pages of publication | 8843 |
a | 21.8059 ± 0.0006 Å |
b | 20.5551 ± 0.0005 Å |
c | 22.2812 ± 0.0005 Å |
α | 90° |
β | 115.892 ± 0.001° |
γ | 90° |
Cell volume | 8984.4 ± 0.4 Å3 |
Cell temperature | 113 ± 2 K |
Ambient diffraction temperature | 113 ± 2 K |
Number of distinct elements | 5 |
Space group number | 14 |
Hermann-Mauguin space group symbol | P 1 21/n 1 |
Hall space group symbol | -P 2yn |
Residual factor for all reflections | 0.1281 |
Residual factor for significantly intense reflections | 0.0648 |
Weighted residual factors for significantly intense reflections | 0.1768 |
Weighted residual factors for all reflections included in the refinement | 0.2426 |
Goodness-of-fit parameter for all reflections included in the refinement | 1.073 |
Diffraction radiation wavelength | 0.71073 Å |
Diffraction radiation type | MoKα |