Information card for entry 7224199
Chemical name | 5,11,17,23-Tetra-tert-butyl-25,27-di[(hydrazinocarbonyl)methoxy]-26,28-di[(hydroxycarbonyl)methoxy]- 2,8,14,20-tetrathiacalix[4]arene |
Formula | C48 H68 N8 O10 S4 |
Calculated formula | C48 H68 N8 O10 S4 |
Title of publication | Synthesis, structure and coordinating properties of novel bifunctional carboxylic derivatives of 1,3-alternate tetrathiacalix[4]arene |
Authors of publication | Podyachev, Sergey Nicolaevich; Gimazetdinova, Gulnaz; Gubaidullin, Aidar Timergalievich; Syakaev, Victor Vasil'evich; Sudakova, Svetlana; Gabidullin, Bulat; Ivanov, Vladimir Timofeevich; Gogolashvili, Edward Lavrentievich; Konovalov, Alexander Ivanovich |
Journal of publication | RSC Adv. |
Year of publication | 2016 |
a | 35.723 ± 0.008 Å |
b | 13.121 ± 0.003 Å |
c | 25.422 ± 0.006 Å |
α | 90° |
β | 108.104 ± 0.003° |
γ | 90° |
Cell volume | 11326 ± 5 Å3 |
Cell temperature | 296 ± 2 K |
Ambient diffraction temperature | 296 ± 2 K |
Number of distinct elements | 5 |
Space group number | 15 |
Hermann-Mauguin space group symbol | C 1 2/c 1 |
Hall space group symbol | -C 2yc |
Residual factor for all reflections | 0.2839 |
Residual factor for significantly intense reflections | 0.0952 |
Weighted residual factors for significantly intense reflections | 0.208 |
Weighted residual factors for all reflections included in the refinement | 0.2684 |
Goodness-of-fit parameter for all reflections included in the refinement | 0.751 |
Diffraction radiation wavelength | 0.71073 Å |
Diffraction radiation type | MoKα |