Information card for entry 7224200
Chemical name | 25,27-Di[(hydrazinocarbonyl)methoxy]-26,28-di[(hydroxycarbonyl)methoxy]-2,8,14,20-tetrathiacalix[4]arene |
Formula | C32 H40 N6 O14 S4 |
Calculated formula | C32 H40 N6 O14 S4 |
Title of publication | Synthesis, structure and coordinating properties of novel bifunctional carboxylic derivatives of 1,3-alternate tetrathiacalix[4]arene |
Authors of publication | Podyachev, Sergey Nicolaevich; Gimazetdinova, Gulnaz; Gubaidullin, Aidar Timergalievich; Syakaev, Victor Vasil'evich; Sudakova, Svetlana; Gabidullin, Bulat; Ivanov, Vladimir Timofeevich; Gogolashvili, Edward Lavrentievich; Konovalov, Alexander Ivanovich |
Journal of publication | RSC Adv. |
Year of publication | 2016 |
a | 10.3996 ± 0.0008 Å |
b | 16.7027 ± 0.0013 Å |
c | 21.9306 ± 0.0018 Å |
α | 90° |
β | 90.249 ± 0.001° |
γ | 90° |
Cell volume | 3809.3 ± 0.5 Å3 |
Cell temperature | 296 ± 2 K |
Ambient diffraction temperature | 296 ± 2 K |
Number of distinct elements | 5 |
Space group number | 14 |
Hermann-Mauguin space group symbol | P 1 21/c 1 |
Hall space group symbol | -P 2ybc |
Residual factor for all reflections | 0.0669 |
Residual factor for significantly intense reflections | 0.0589 |
Weighted residual factors for significantly intense reflections | 0.1455 |
Weighted residual factors for all reflections included in the refinement | 0.1503 |
Goodness-of-fit parameter for all reflections included in the refinement | 1.11 |
Diffraction radiation wavelength | 0.71073 Å |
Diffraction radiation type | MoKα |