Information card for entry 7224245
Formula |
C16 H19 Cu N5 O |
Calculated formula |
C16 H19 Cu N5 O |
Title of publication |
Field-induced Ferromagnetism due to Magneto-striction in 1-D helical chain |
Authors of publication |
shaw, Bikash kumar; Das, Mithun; Bhattacharyya, Anik; Ghosh, Biswa Nath; Roy, Susmita; Mandal, Prabhat; Rissanen, Kari; Chattopadhyay, Shouvik; saha, Shyamal Kumar |
Journal of publication |
RSC Adv. |
Year of publication |
2016 |
a |
8.3103 ± 0.0003 Å |
b |
9.0566 ± 0.0005 Å |
c |
20.1313 ± 0.001 Å |
α |
90° |
β |
90° |
γ |
90° |
Cell volume |
1515.14 ± 0.13 Å3 |
Cell temperature |
123 ± 2 K |
Ambient diffraction temperature |
123 ± 2 K |
Number of distinct elements |
5 |
Space group number |
19 |
Hermann-Mauguin space group symbol |
P 21 21 21 |
Hall space group symbol |
P 2ac 2ab |
Residual factor for all reflections |
0.0561 |
Residual factor for significantly intense reflections |
0.0439 |
Weighted residual factors for significantly intense reflections |
0.0821 |
Weighted residual factors for all reflections included in the refinement |
0.0862 |
Goodness-of-fit parameter for all reflections included in the refinement |
1.074 |
Diffraction radiation wavelength |
0.71073 Å |
Diffraction radiation type |
MoKα |
Yes |
No |
No |