Information card for entry 7224246
Formula |
C16 H17 Cu N3 O2 |
Calculated formula |
C16 H17 Cu N3 O2 |
SMILES |
[Cu]12(Oc3c(c4c(cc3)cccc4)C=[N]2CC[N]1(C)C)N=C=O |
Title of publication |
Field-induced Ferromagnetism due to Magneto-striction in 1-D helical chain |
Authors of publication |
shaw, Bikash kumar; Das, Mithun; Bhattacharyya, Anik; Ghosh, Biswa Nath; Roy, Susmita; Mandal, Prabhat; Rissanen, Kari; Chattopadhyay, Shouvik; saha, Shyamal Kumar |
Journal of publication |
RSC Adv. |
Year of publication |
2016 |
a |
6.9439 ± 0.0002 Å |
b |
7.7514 ± 0.0002 Å |
c |
27.556 ± 0.0008 Å |
α |
90° |
β |
90° |
γ |
90° |
Cell volume |
1483.2 ± 0.07 Å3 |
Cell temperature |
173 ± 2 K |
Ambient diffraction temperature |
173 ± 2 K |
Number of distinct elements |
5 |
Space group number |
19 |
Hermann-Mauguin space group symbol |
P 21 21 21 |
Hall space group symbol |
P 2ac 2ab |
Residual factor for all reflections |
0.0261 |
Residual factor for significantly intense reflections |
0.0243 |
Weighted residual factors for significantly intense reflections |
0.0592 |
Weighted residual factors for all reflections included in the refinement |
0.0605 |
Goodness-of-fit parameter for all reflections included in the refinement |
1.074 |
Diffraction radiation wavelength |
0.71073 Å |
Diffraction radiation type |
MoKα |
Yes |
No |
No |