Information card for entry 7224415
Formula | C37 H28 Cl N3 O2 |
Calculated formula | C37 H28 Cl N3 O2 |
SMILES | c1ccccc1CN1C(=O)[C@@]2(c3cc(C)ccc13)[C@H](C(=O)c1ccc(cc1)Cl)[C@H]1CCc3ccccc3C1=C(C2=N)C#N.c1ccccc1CN1C(=O)[C@]2(c3cc(C)ccc13)[C@@H](C(=O)c1ccc(cc1)Cl)[C@@H]1CCc3ccccc3C1=C(C2=N)C#N |
Title of publication | Molecular diversity of cyclization reaction of 3-methyleneoxindoles with 2-(3,4-dihydronaphthalen-1(2H)-ylidene)malononitriles |
Authors of publication | Lu, Yu-Ling; Sun, Jing; Xie, Ya-Jing; Yan, Chao Guo |
Journal of publication | RSC Adv. |
Year of publication | 2016 |
a | 9.762 ± 0.003 Å |
b | 12.247 ± 0.003 Å |
c | 12.796 ± 0.004 Å |
α | 102.081 ± 0.003° |
β | 97.905 ± 0.004° |
γ | 93.279 ± 0.004° |
Cell volume | 1475.9 ± 0.7 Å3 |
Cell temperature | 296 ± 2 K |
Ambient diffraction temperature | 296 ± 2 K |
Number of distinct elements | 5 |
Space group number | 2 |
Hermann-Mauguin space group symbol | P -1 |
Hall space group symbol | -P 1 |
Residual factor for all reflections | 0.0949 |
Residual factor for significantly intense reflections | 0.0546 |
Weighted residual factors for significantly intense reflections | 0.1115 |
Weighted residual factors for all reflections included in the refinement | 0.131 |
Goodness-of-fit parameter for all reflections included in the refinement | 1.018 |
Diffraction radiation wavelength | 0.71073 Å |
Diffraction radiation type | MoKα |