Information card for entry 7224416
Formula | C37 H28 F N3 O2 |
Calculated formula | C37 H28 F N3 O2 |
SMILES | c1ccccc1CN1C(=O)[C@@]2(c3cc(ccc13)F)[C@H](C(=O)c1ccc(C)cc1)[C@@H]1C(=C(C2=N)C#N)c2c(CC1)cccc2.c1ccccc1CN1C(=O)[C@]2(c3cc(ccc13)F)[C@@H](C(=O)c1ccc(C)cc1)[C@H]1C(=C(C2=N)C#N)c2c(CC1)cccc2 |
Title of publication | Molecular diversity of cyclization reaction of 3-methyleneoxindoles with 2-(3,4-dihydronaphthalen-1(2H)-ylidene)malononitriles |
Authors of publication | Lu, Yu-Ling; Sun, Jing; Xie, Ya-Jing; Yan, Chao Guo |
Journal of publication | RSC Adv. |
Year of publication | 2016 |
a | 21.477 ± 0.0017 Å |
b | 19.1094 ± 0.0015 Å |
c | 15.1357 ± 0.0016 Å |
α | 90° |
β | 115.428 ± 0.003° |
γ | 90° |
Cell volume | 5610.1 ± 0.9 Å3 |
Cell temperature | 296 ± 2 K |
Ambient diffraction temperature | 296 ± 2 K |
Number of distinct elements | 5 |
Space group number | 15 |
Hermann-Mauguin space group symbol | C 1 2/c 1 |
Hall space group symbol | -C 2yc |
Residual factor for all reflections | 0.122 |
Residual factor for significantly intense reflections | 0.0532 |
Weighted residual factors for significantly intense reflections | 0.1004 |
Weighted residual factors for all reflections included in the refinement | 0.123 |
Goodness-of-fit parameter for all reflections included in the refinement | 1.032 |
Diffraction radiation wavelength | 0.71073 Å |
Diffraction radiation type | MoKα |