Information card for entry 7224983
Formula | Br8 H32 Mo6 O18 |
Calculated formula | Br8 H31.92 Mo6 O18 |
Title of publication | On the synthesis and characterisation of luminescent hybrid particles: Mo6metal cluster complex / SiO2 |
Authors of publication | Vorotnikov, Yuri A.; Efremova, Olga A.; Vorotnikova, Natalya A.; Brylev, Konstantin; Edeleva, Mariya V.; Tsygankova, Alphiya R.; Smolentsev, Anton I.; Kitamura, N.; Mironov, Yuri V.; Shestopalov, Michael A. |
Journal of publication | RSC Adv. |
Year of publication | 2016 |
a | 15.2397 ± 0.0004 Å |
b | 15.2397 ± 0.0004 Å |
c | 11.1438 ± 0.0003 Å |
α | 90° |
β | 90° |
γ | 120° |
Cell volume | 2241.39 ± 0.1 Å3 |
Cell temperature | 150 ± 2 K |
Ambient diffraction temperature | 150 ± 2 K |
Number of distinct elements | 4 |
Space group number | 166 |
Hermann-Mauguin space group symbol | R -3 m :H |
Hall space group symbol | -R 3 2" |
Residual factor for all reflections | 0.0114 |
Residual factor for significantly intense reflections | 0.0107 |
Weighted residual factors for significantly intense reflections | 0.0259 |
Weighted residual factors for all reflections included in the refinement | 0.026 |
Goodness-of-fit parameter for all reflections included in the refinement | 1.124 |
Diffraction radiation wavelength | 0.71073 Å |
Diffraction radiation type | MoKα |