Information card for entry 7224984
Formula | H32 I8 Mo6 O18 |
Calculated formula | H31.92 I8 Mo6 O18 |
Title of publication | On the synthesis and characterisation of luminescent hybrid particles: Mo6metal cluster complex / SiO2 |
Authors of publication | Vorotnikov, Yuri A.; Efremova, Olga A.; Vorotnikova, Natalya A.; Brylev, Konstantin; Edeleva, Mariya V.; Tsygankova, Alphiya R.; Smolentsev, Anton I.; Kitamura, N.; Mironov, Yuri V.; Shestopalov, Michael A. |
Journal of publication | RSC Adv. |
Year of publication | 2016 |
a | 15.7382 ± 0.0011 Å |
b | 15.7382 ± 0.0011 Å |
c | 11.3109 ± 0.0007 Å |
α | 90° |
β | 90° |
γ | 120° |
Cell volume | 2426.3 ± 0.3 Å3 |
Cell temperature | 150 ± 2 K |
Ambient diffraction temperature | 150 ± 2 K |
Number of distinct elements | 4 |
Space group number | 166 |
Hermann-Mauguin space group symbol | R -3 m :H |
Hall space group symbol | -R 3 2" |
Residual factor for all reflections | 0.0187 |
Residual factor for significantly intense reflections | 0.0166 |
Weighted residual factors for significantly intense reflections | 0.0366 |
Weighted residual factors for all reflections included in the refinement | 0.0373 |
Goodness-of-fit parameter for all reflections included in the refinement | 1.163 |
Diffraction radiation wavelength | 0.71073 Å |
Diffraction radiation type | MoKα |