Information card for entry 7225046
Formula | C132 H84 N18 Nd2 O17 |
Calculated formula | C132 H84 N18 Nd2 O17 |
Title of publication | Syntheses, crystal structures and luminescence properties of lanthanide-based coordination polymers constructed from a functionalized terpyridyl carboxylate ligand |
Authors of publication | Xu, Bing; Cheng, Yue; Hu, Huai-Ming; Bai, Chao; Wang, Xiaofang; Yang, Meng-Lin; Xue, Ganglin |
Journal of publication | CrystEngComm |
Year of publication | 2016 |
Journal volume | 18 |
Journal issue | 24 |
Pages of publication | 4613 |
a | 13.6238 ± 0.001 Å |
b | 14.4019 ± 0.001 Å |
c | 16.3902 ± 0.0012 Å |
α | 78.797 ± 0.001° |
β | 77.346 ± 0.001° |
γ | 65.537 ± 0.001° |
Cell volume | 2836.6 ± 0.4 Å3 |
Cell temperature | 296 ± 2 K |
Ambient diffraction temperature | 296 ± 2 K |
Number of distinct elements | 5 |
Space group number | 2 |
Hermann-Mauguin space group symbol | P -1 |
Hall space group symbol | -P 1 |
Residual factor for all reflections | 0.0589 |
Residual factor for significantly intense reflections | 0.0478 |
Weighted residual factors for significantly intense reflections | 0.1271 |
Weighted residual factors for all reflections included in the refinement | 0.1378 |
Goodness-of-fit parameter for all reflections included in the refinement | 0.951 |
Diffraction radiation wavelength | 0.71073 Å |
Diffraction radiation type | MoKα |