Information card for entry 7225047
Formula | C132 H84 N18 O17 Sm2 |
Calculated formula | C132 H84 N18 O17 Sm2 |
Title of publication | Syntheses, crystal structures and luminescence properties of lanthanide-based coordination polymers constructed from a functionalized terpyridyl carboxylate ligand |
Authors of publication | Xu, Bing; Cheng, Yue; Hu, Huai-Ming; Bai, Chao; Wang, Xiaofang; Yang, Meng-Lin; Xue, Ganglin |
Journal of publication | CrystEngComm |
Year of publication | 2016 |
Journal volume | 18 |
Journal issue | 24 |
Pages of publication | 4613 |
a | 13.6332 ± 0.0018 Å |
b | 14.3983 ± 0.0019 Å |
c | 16.347 ± 0.002 Å |
α | 78.969 ± 0.003° |
β | 77.335 ± 0.003° |
γ | 65.518 ± 0.002° |
Cell volume | 2831 ± 0.6 Å3 |
Cell temperature | 296 ± 2 K |
Ambient diffraction temperature | 296 ± 2 K |
Number of distinct elements | 5 |
Space group number | 2 |
Hermann-Mauguin space group symbol | P -1 |
Hall space group symbol | -P 1 |
Residual factor for all reflections | 0.1106 |
Residual factor for significantly intense reflections | 0.0699 |
Weighted residual factors for significantly intense reflections | 0.1269 |
Weighted residual factors for all reflections included in the refinement | 0.1495 |
Goodness-of-fit parameter for all reflections included in the refinement | 0.967 |
Diffraction radiation wavelength | 0.71073 Å |
Diffraction radiation type | MoKα |