Information card for entry 7225048
Formula | C132 H84 Eu2 N18 O17 |
Calculated formula | C132 H84 Eu2 N18 O17 |
Title of publication | Syntheses, crystal structures and luminescence properties of lanthanide-based coordination polymers constructed from a functionalized terpyridyl carboxylate ligand |
Authors of publication | Xu, Bing; Cheng, Yue; Hu, Huai-Ming; Bai, Chao; Wang, Xiaofang; Yang, Meng-Lin; Xue, Ganglin |
Journal of publication | CrystEngComm |
Year of publication | 2016 |
Journal volume | 18 |
Journal issue | 24 |
Pages of publication | 4613 |
a | 13.659 ± 0.003 Å |
b | 14.392 ± 0.003 Å |
c | 16.317 ± 0.003 Å |
α | 78.947 ± 0.003° |
β | 77.37 ± 0.004° |
γ | 65.555 ± 0.004° |
Cell volume | 2830.8 ± 1 Å3 |
Cell temperature | 296 ± 2 K |
Ambient diffraction temperature | 296 ± 2 K |
Number of distinct elements | 5 |
Space group number | 2 |
Hermann-Mauguin space group symbol | P -1 |
Hall space group symbol | -P 1 |
Residual factor for all reflections | 0.1129 |
Residual factor for significantly intense reflections | 0.0898 |
Weighted residual factors for significantly intense reflections | 0.1854 |
Weighted residual factors for all reflections included in the refinement | 0.2028 |
Goodness-of-fit parameter for all reflections included in the refinement | 1.083 |
Diffraction radiation wavelength | 0.71073 Å |
Diffraction radiation type | MoKα |