Information card for entry 7225447
Formula | C16 H20 N4 Ni O4 P2 S5 |
Calculated formula | C16 H20 N4 Ni O4 P2 S5 |
Title of publication | Coordination polymers and polygons using di-pyridyl-thiadiazole spacers and substituted phosphorodithioato NiIIcomplexes: potential and limitations for inorganic crystal engineering |
Authors of publication | Aragoni, M. Carla; Arca, Massimiliano; Coles, Simon J.; Crespo Alonso, Miriam; Coles (née Huth), Susanne L.; Davies, Robert P.; Hursthouse, Michael B.; Isaia, Francesco; Lai, Romina; Lippolis, Vito |
Journal of publication | CrystEngComm |
Year of publication | 2016 |
Journal volume | 18 |
Journal issue | 30 |
Pages of publication | 5620 |
a | 16.542 ± 0.003 Å |
b | 7.489 ± 0.002 Å |
c | 20.642 ± 0.006 Å |
α | 90° |
β | 94.29 ± 0.02° |
γ | 90° |
Cell volume | 2550 ± 1.1 Å3 |
Cell temperature | 120 ± 2 K |
Ambient diffraction temperature | 120 ± 2 K |
Number of distinct elements | 7 |
Space group number | 14 |
Hermann-Mauguin space group symbol | P 1 21/c 1 |
Hall space group symbol | -P 2ybc |
Residual factor for all reflections | 0.0868 |
Residual factor for significantly intense reflections | 0.0492 |
Weighted residual factors for significantly intense reflections | 0.1031 |
Weighted residual factors for all reflections included in the refinement | 0.1164 |
Goodness-of-fit parameter for all reflections included in the refinement | 1.051 |
Diffraction radiation wavelength | 0.71073 Å |
Diffraction radiation type | MoKα |