Information card for entry 7225448
Chemical name | 2007slh0906/187 |
Formula | C28 H28 N4 Ni O4 P2 S5 |
Calculated formula | C28 H28 N4 Ni O4 P2 S5 |
Title of publication | Coordination polymers and polygons using di-pyridyl-thiadiazole spacers and substituted phosphorodithioato NiIIcomplexes: potential and limitations for inorganic crystal engineering |
Authors of publication | Aragoni, M. Carla; Arca, Massimiliano; Coles, Simon J.; Crespo Alonso, Miriam; Coles (née Huth), Susanne L.; Davies, Robert P.; Hursthouse, Michael B.; Isaia, Francesco; Lai, Romina; Lippolis, Vito |
Journal of publication | CrystEngComm |
Year of publication | 2016 |
Journal volume | 18 |
Journal issue | 30 |
Pages of publication | 5620 |
a | 9.7075 ± 0.0002 Å |
b | 10.6736 ± 0.0002 Å |
c | 17.4582 ± 0.0003 Å |
α | 73.23 ± 0.001° |
β | 87.086 ± 0.001° |
γ | 72.131 ± 0.001° |
Cell volume | 1647.02 ± 0.06 Å3 |
Cell temperature | 120 ± 2 K |
Ambient diffraction temperature | 120 ± 2 K |
Number of distinct elements | 7 |
Space group number | 2 |
Hermann-Mauguin space group symbol | P -1 |
Hall space group symbol | -P 1 |
Residual factor for all reflections | 0.0474 |
Residual factor for significantly intense reflections | 0.0361 |
Weighted residual factors for significantly intense reflections | 0.0798 |
Weighted residual factors for all reflections included in the refinement | 0.085 |
Goodness-of-fit parameter for all reflections included in the refinement | 1.038 |
Diffraction radiation wavelength | 0.71073 Å |
Diffraction radiation type | MoKα |