Information card for entry 7225466
Formula | C17 H20 Cu2 Eu I2 N2 O10 |
Calculated formula | C17 H20 Cu2 Eu I2 N2 O10 |
Title of publication | Copper(i)‒lanthanide(iii) heterometallic metal‒organic frameworks constructed from 3-(3-pyridyl)acrylic acid: syntheses, structures, and properties |
Authors of publication | Dong, Ruo-Ting; Chen, Xin-Li; Cui, Xiao; Chen, Su-Su; Shen, Mo-Yuan; Li, Chu-Wen; Li, Qian-Hong; Hu, Ming-Yuan; Huang, Lan-Fen; Deng, Hong |
Journal of publication | CrystEngComm |
Year of publication | 2016 |
Journal volume | 18 |
Journal issue | 29 |
Pages of publication | 5547 |
a | 8.1814 ± 0.0011 Å |
b | 8.2858 ± 0.0011 Å |
c | 18.974 ± 0.003 Å |
α | 86.452 ± 0.003° |
β | 84.078 ± 0.002° |
γ | 79.676 ± 0.002° |
Cell volume | 1257.4 ± 0.3 Å3 |
Cell temperature | 293 ± 2 K |
Ambient diffraction temperature | 293 ± 2 K |
Number of distinct elements | 7 |
Space group number | 2 |
Hermann-Mauguin space group symbol | P -1 |
Hall space group symbol | -P 1 |
Residual factor for all reflections | 0.0617 |
Residual factor for significantly intense reflections | 0.0451 |
Weighted residual factors for significantly intense reflections | 0.1008 |
Weighted residual factors for all reflections included in the refinement | 0.1207 |
Goodness-of-fit parameter for all reflections included in the refinement | 1.069 |
Diffraction radiation wavelength | 0.71073 Å |
Diffraction radiation type | MoKα |