Information card for entry 7225467
Formula | C17 H20 Cu2 Gd I2 N2 O10 |
Calculated formula | C17 H20 Cu2 Gd I2 N2 O10 |
Title of publication | Copper(i)‒lanthanide(iii) heterometallic metal‒organic frameworks constructed from 3-(3-pyridyl)acrylic acid: syntheses, structures, and properties |
Authors of publication | Dong, Ruo-Ting; Chen, Xin-Li; Cui, Xiao; Chen, Su-Su; Shen, Mo-Yuan; Li, Chu-Wen; Li, Qian-Hong; Hu, Ming-Yuan; Huang, Lan-Fen; Deng, Hong |
Journal of publication | CrystEngComm |
Year of publication | 2016 |
Journal volume | 18 |
Journal issue | 29 |
Pages of publication | 5547 |
a | 8.161 ± 0.003 Å |
b | 8.25 ± 0.003 Å |
c | 18.961 ± 0.006 Å |
α | 86.444 ± 0.007° |
β | 83.969 ± 0.006° |
γ | 79.622 ± 0.006° |
Cell volume | 1247.6 ± 0.8 Å3 |
Cell temperature | 296 ± 2 K |
Ambient diffraction temperature | 296.15 K |
Number of distinct elements | 7 |
Space group number | 2 |
Hermann-Mauguin space group symbol | P -1 |
Hall space group symbol | -P 1 |
Residual factor for all reflections | 0.0958 |
Residual factor for significantly intense reflections | 0.0661 |
Weighted residual factors for significantly intense reflections | 0.1541 |
Weighted residual factors for all reflections included in the refinement | 0.1739 |
Goodness-of-fit parameter for all reflections included in the refinement | 0.954 |
Diffraction radiation wavelength | 0.71073 Å |
Diffraction radiation type | MoKα |