Information card for entry 7225772
Formula
C24 H28 La2 N4 O19
Calculated formula
C24 H16 La2 N4 O15
Title of publication
From 1D to 3D Lanthanide Coordination Polymers Constructed with Pyridine-3, 5-dicarboxylic Acid: Synthesis, Crystal Structures, and Catalytic Properties
Authors of publication
Lin, Xiao-Ming; Niu, Ji-Liang; Wen, Pei-Xian; Lu, Yan-Na; Hu, Lei; Zhang, Da-Liang; Cai, Yue-Peng
Journal of publication
RSC Adv.
Year of publication
2016
a
8.9602 ± 0.0013 Å
b
10.7764 ± 0.0016 Å
c
19.041 ± 0.003 Å
α
75.382 ± 0.002°
β
83.782 ± 0.002°
γ
69.363 ± 0.002°
Cell volume
1664.5 ± 0.4 Å3
Cell temperature
296 ± 2 K
Ambient diffraction temperature
296 ± 2 K
Number of distinct elements
5
Space group number
2
Hermann-Mauguin space group symbol
P -1
Hall space group symbol
-P 1
Residual factor for all reflections
0.0433
Residual factor for significantly intense reflections
0.0395
Weighted residual factors for significantly intense reflections
0.098
Weighted residual factors for all reflections included in the refinement
0.1004
Goodness-of-fit parameter for all reflections included in the refinement
1.038
Diffraction radiation wavelength
0.71073 Å
Diffraction radiation type
MoKα
Yes
Yes
No