Information card for entry 7225773
Formula
C24 H28 N4 O19 Pr2
Calculated formula
C24 H20 N4 O15 Pr2
Title of publication
From 1D to 3D Lanthanide Coordination Polymers Constructed with Pyridine-3, 5-dicarboxylic Acid: Synthesis, Crystal Structures, and Catalytic Properties
Authors of publication
Lin, Xiao-Ming; Niu, Ji-Liang; Wen, Pei-Xian; Lu, Yan-Na; Hu, Lei; Zhang, Da-Liang; Cai, Yue-Peng
Journal of publication
RSC Adv.
Year of publication
2016
a
8.8723 ± 0.0012 Å
b
10.7152 ± 0.0015 Å
c
18.92 ± 0.003 Å
α
75.496 ± 0.002°
β
83.797 ± 0.002°
γ
69.336 ± 0.002°
Cell volume
1629 ± 0.4 Å3
Cell temperature
296 ± 2 K
Ambient diffraction temperature
296 ± 2 K
Number of distinct elements
5
Space group number
2
Hermann-Mauguin space group symbol
P -1
Hall space group symbol
-P 1
Residual factor for all reflections
0.0355
Residual factor for significantly intense reflections
0.0299
Weighted residual factors for significantly intense reflections
0.0757
Weighted residual factors for all reflections included in the refinement
0.0791
Goodness-of-fit parameter for all reflections included in the refinement
1.017
Diffraction radiation wavelength
0.71073 Å
Diffraction radiation type
MoKα
Yes
Yes
No