Information card for entry 7225775
Formula
C24 H28 N4 O19 Tb2
Calculated formula
C22 H20 N3 O19 Tb2
Title of publication
From 1D to 3D Lanthanide Coordination Polymers Constructed with Pyridine-3, 5-dicarboxylic Acid: Synthesis, Crystal Structures, and Catalytic Properties
Authors of publication
Lin, Xiao-Ming; Niu, Ji-Liang; Wen, Pei-Xian; Lu, Yan-Na; Hu, Lei; Zhang, Da-Liang; Cai, Yue-Peng
Journal of publication
RSC Adv.
Year of publication
2016
a
10.0739 ± 0.0019 Å
b
20.13 ± 0.004 Å
c
17.349 ± 0.003 Å
α
90°
β
113.934 ± 0.008°
γ
90°
Cell volume
3215.6 ± 1.1 Å3
Cell temperature
293 ± 2 K
Ambient diffraction temperature
293 ± 2 K
Number of distinct elements
5
Space group number
14
Hermann-Mauguin space group symbol
P 1 21/c 1
Hall space group symbol
-P 2ybc
Residual factor for all reflections
0.0304
Residual factor for significantly intense reflections
0.0248
Weighted residual factors for significantly intense reflections
0.0555
Weighted residual factors for all reflections included in the refinement
0.058
Goodness-of-fit parameter for all reflections included in the refinement
1.028
Diffraction radiation wavelength
0.71073 Å
Diffraction radiation type
MoKα
Yes
No
No