Information card for entry 7225774
Formula
C24 H28 N4 O19 Sm2
Calculated formula
C24 H20 N4 O15 Sm2
Title of publication
From 1D to 3D Lanthanide Coordination Polymers Constructed with Pyridine-3, 5-dicarboxylic Acid: Synthesis, Crystal Structures, and Catalytic Properties
Authors of publication
Lin, Xiao-Ming; Niu, Ji-Liang; Wen, Pei-Xian; Lu, Yan-Na; Hu, Lei; Zhang, Da-Liang; Cai, Yue-Peng
Journal of publication
RSC Adv.
Year of publication
2016
a
8.8475 ± 0.0018 Å
b
10.716 ± 0.002 Å
c
18.895 ± 0.004 Å
α
75.521 ± 0.002°
β
83.777 ± 0.002°
γ
69.306 ± 0.002°
Cell volume
1622.2 ± 0.6 Å3
Cell temperature
296 ± 2 K
Ambient diffraction temperature
296 ± 2 K
Number of distinct elements
5
Space group number
2
Hermann-Mauguin space group symbol
P -1
Hall space group symbol
-P 1
Residual factor for all reflections
0.0622
Residual factor for significantly intense reflections
0.0564
Weighted residual factors for significantly intense reflections
0.1547
Weighted residual factors for all reflections included in the refinement
0.1605
Goodness-of-fit parameter for all reflections included in the refinement
1.026
Diffraction radiation wavelength
0.71073 Å
Diffraction radiation type
MoKα
Yes
No
No